Uploaded image for project: 'Data Management'
  1. Data Management
  2. DM-15092

ci_hsc failed 2018_07_11 night build

    Details

    • Type: Story
    • Status: Done
    • Resolution: Done
    • Fix Version/s: None
    • Component/s: None
    • Labels:
      None

      Description

        Attachments

          Issue Links

            Activity

            Hide
            hchiang2 Hsin-Fang Chiang added a comment -

            :::::  [2018-07-12T06:04:47.399372Z]   File "/j/ws/scipipe/ci_hsc/centos-7.devtoolset-6.py3/lsstsw/build/ci_hsc/python/lsst/ci/hsc/validate.py", line 60, in main
            :::::  [2018-07-12T06:04:47.399383Z]     validator.run({})
            :::::  [2018-07-12T06:04:47.399392Z]   File "/j/ws/scipipe/ci_hsc/centos-7.devtoolset-6.py3/lsstsw/build/ci_hsc/python/lsst/ci/hsc/validate.py", line 334, in run
            :::::  [2018-07-12T06:04:47.399402Z]     self.assertTrue(pkg + " in packages", pkg in packages)
            :::::  [2018-07-12T06:04:47.399412Z]   File "/j/ws/scipipe/ci_hsc/centos-7.devtoolset-6.py3/lsstsw/build/ci_hsc/python/lsst/ci/hsc/validate.py", line 90, in assertTrue
            :::::  [2018-07-12T06:04:47.399421Z]     raise AssertionError("Failed test: %s" % description)
            :::::  [2018-07-12T06:04:47.399431Z] AssertionError: Failed test: pyfits in packages
            :::::  [2018-07-12T06:04:47.533497Z] scons: *** [.scons/versions] Error 1
            

            Looks like we no longer require pyfits. I'm removing it from the list at https://github.com/lsst/ci_hsc/pull/48

            Show
            hchiang2 Hsin-Fang Chiang added a comment - ::::: [ 2018 - 07 -12T06: 04 : 47 .399372Z] File "/j/ws/scipipe/ci_hsc/centos-7.devtoolset-6.py3/lsstsw/build/ci_hsc/python/lsst/ci/hsc/validate.py" , line 60 , in main ::::: [ 2018 - 07 -12T06: 04 : 47 .399383Z] validator.run({}) ::::: [ 2018 - 07 -12T06: 04 : 47 .399392Z] File "/j/ws/scipipe/ci_hsc/centos-7.devtoolset-6.py3/lsstsw/build/ci_hsc/python/lsst/ci/hsc/validate.py" , line 334 , in run ::::: [ 2018 - 07 -12T06: 04 : 47 .399402Z] self.assertTrue(pkg + " in packages" , pkg in packages) ::::: [ 2018 - 07 -12T06: 04 : 47 .399412Z] File "/j/ws/scipipe/ci_hsc/centos-7.devtoolset-6.py3/lsstsw/build/ci_hsc/python/lsst/ci/hsc/validate.py" , line 90 , in assertTrue ::::: [ 2018 - 07 -12T06: 04 : 47 .399421Z] raise AssertionError( "Failed test: %s" % description) ::::: [ 2018 - 07 -12T06: 04 : 47 .399431Z] AssertionError: Failed test: pyfits in packages ::::: [ 2018 - 07 -12T06: 04 : 47 .533497Z] scons: *** [.scons/versions] Error 1 Looks like we no longer require pyfits. I'm removing it from the list at https://github.com/lsst/ci_hsc/pull/48
            Hide
            tjenness Tim Jenness added a comment -

            I'm sorry. Never crossed my mind that we had a test to ensure that certain python packages were set up. This test worries me a bit but the fix is correct. DM-7886 caused this.

            Show
            tjenness Tim Jenness added a comment - I'm sorry. Never crossed my mind that we had a test to ensure that certain python packages were set up. This test worries me a bit but the fix is correct. DM-7886 caused this.
            Hide
            hchiang2 Hsin-Fang Chiang added a comment -
            Show
            hchiang2 Hsin-Fang Chiang added a comment - Thanks for the quick review. ci_hsc builds fine with the fix: https://ci.lsst.codes/blue/organizations/jenkins/stack-os-matrix/detail/stack-os-matrix/28198/pipeline

              People

              • Assignee:
                hchiang2 Hsin-Fang Chiang
                Reporter:
                hchiang2 Hsin-Fang Chiang
                Reviewers:
                Tim Jenness
                Watchers:
                Hsin-Fang Chiang, Tim Jenness
              • Votes:
                0 Vote for this issue
                Watchers:
                2 Start watching this issue

                Dates

                • Created:
                  Updated:
                  Resolved:

                  Summary Panel