Uploaded image for project: 'Data Management'
  1. Data Management
  2. DM-5132

obs_subaru install with eups distrib fails

    Details

    • Type: Bug
    • Status: Done
    • Resolution: Done
    • Fix Version/s: None
    • Component/s: lsstsw, obs_subaru
    • Labels:
      None
    • Story Points:
      1
    • Sprint:
      Science Pipelines DM-W16-6
    • Team:
      Data Release Production

      Description

      Thus:

      $ eups distrib install -t w_2016_06 obs_subaru
      ...
        [ 52/52 ]  obs_subaru 5.0.0.1-60-ge4efae7+2 ...
       
      ***** error: from /Users/jds/Projects/Astronomy/LSST/stack/EupsBuildDir/DarwinX86/obs_subaru-5.0.0.1-60-ge4efae7+2/build.log:
      ----------------------------------------------------------------------
      Traceback (most recent call last):
        File "tests/hscRepository.py", line 91, in setUp
          self.repoPath = createDataRepository("lsst.obs.hsc.HscMapper", rawPath)
        File "tests/hscRepository.py", line 63, in createDataRepository
          check_call([ingest_cmd, repoPath] + glob(os.path.join(inputPath, "*.fits.gz")))
        File "/opt/local/Library/Frameworks/Python.framework/Versions/2.7/lib/python2.7/subprocess.py", line 540, in check_call
          raise CalledProcessError(retcode, cmd)
      CalledProcessError: Command '['/Users/jds/Projects/Astronomy/LSST/stack/EupsBuildDir/DarwinX86/obs_subaru-5.0.0.1-60-ge4efae7+2/obs_subaru-5.0.0.1-60-ge4efae7+2/bin/hscIngestImages.py', '/var/folders/jp/lqz3n0m17nqft7bwtw3b8n380000gp/T/tmptUSKuf', '/Users/jds/Projects/Astronomy/LSST/stack/DarwinX86/testdata_subaru/master-gf9ba9abdbe/hsc/raw/HSCA90402512.fits.gz']' returned non-zero exit status 1
       
      ----------------------------------------------------------------------
      Ran 8 tests in 9.928s
       
      FAILED (errors=7)
      The following tests failed:
      /Users/jds/Projects/Astronomy/LSST/stack/EupsBuildDir/DarwinX86/obs_subaru-5.0.0.1-60-ge4efae7+2/obs_subaru-5.0.0.1-60-ge4efae7+2/tests/.tests/hscRepository.py.failed
      1 tests failed
      scons: *** [checkTestStatus] Error 1
      scons: building terminated because of errors.
      + exit -4
      

      Please fix it.

        Attachments

          Issue Links

            Activity

            swinbank John Swinbank created issue -
            swinbank John Swinbank made changes -
            Field Original Value New Value
            Reviewers Joshua Hoblitt [ jhoblitt ]
            Status To Do [ 10001 ] In Review [ 10004 ]
            swinbank John Swinbank made changes -
            Assignee Frossie Economou [ frossie ] John Swinbank [ swinbank ]
            swinbank John Swinbank made changes -
            Epic Link DM-3586 [ 19683 ]
            swinbank John Swinbank made changes -
            Sprint Science Pipelines DM-W16-6 [ 195 ]
            Story Points 1
            Team Data Release Production [ 10301 ]
            Issue Type Story [ 10001 ] Bug [ 1 ]
            swinbank John Swinbank made changes -
            Resolution Done [ 10000 ]
            Status In Review [ 10004 ] Done [ 10002 ]
            jhoblitt Joshua Hoblitt made changes -
            Link This issue relates to DM-5138 [ DM-5138 ]
            tjenness Tim Jenness made changes -
            Link This issue relates to DM-14705 [ DM-14705 ]

              People

              • Assignee:
                swinbank John Swinbank
                Reporter:
                swinbank John Swinbank
                Reviewers:
                Joshua Hoblitt
                Watchers:
                John Swinbank, Joshua Hoblitt, Mario Juric, Michael Wood-Vasey, Tim Jenness
              • Votes:
                0 Vote for this issue
                Watchers:
                5 Start watching this issue

                Dates

                • Created:
                  Updated:
                  Resolved:

                  Summary Panel