Uploaded image for project: 'Data Management'
  1. Data Management
  2. DM-7701

conda-lsst ndarray test failure

    Details

    • Type: Story
    • Status: Done
    • Resolution: Done
    • Fix Version/s: None
    • Component/s: ndarray
    • Labels:
      None

      Description

      The conda-lsst build log for the test failure can be found here:

      https://gist.github.com/jmatt/dcb6ce8312aac1ff81cbb923703d8430

      Running tests...
      Test project /Users/square/dev/conda-lsst/miniconda/conda-bld/work/build
          Start 1: test_ndarray
      1/5 Test #1: test_ndarray .....................   Passed    0.01 sec
          Start 2: test_views
      2/5 Test #2: test_views .......................   Passed    0.01 sec
          Start 3: test_ndarray-fft
      3/5 Test #3: test_ndarray-fft .................***Exception: Other  0.00 sec
          Start 4: test_ndarray_eigen
      4/5 Test #4: test_ndarray_eigen ...............   Passed    0.01 sec
          Start 5: swig_test
      5/5 Test #5: swig_test ........................   Passed    0.11 sec
       
      80% tests passed, 1 tests failed out of 5
       
      Total Test time (real) =   0.14 sec
       
      The following tests FAILED:
      	  3 - test_ndarray-fft (OTHER_FAULT)
      Errors while running CTest
      make: *** [test] Error 8
      

        Attachments

          Issue Links

            Activity

            jmatt J Matt Peterson [X] (Inactive) created issue -
            jmatt J Matt Peterson [X] (Inactive) made changes -
            Field Original Value New Value
            Epic Link DM-6213 [ 24729 ]
            jmatt J Matt Peterson [X] (Inactive) made changes -
            Link This issue relates to DM-6583 [ DM-6583 ]
            tjenness Tim Jenness made changes -
            Watchers J Matt Peterson [ J Matt Peterson ] J Matt Peterson, Pim Schellart [ J Matt Peterson, Pim Schellart ]
            tjenness Tim Jenness made changes -
            Component/s ndarray [ 10761 ]
            jmatt J Matt Peterson [X] (Inactive) made changes -
            Status To Do [ 10001 ] In Progress [ 3 ]
            jmatt J Matt Peterson [X] (Inactive) made changes -
            Story Points 1
            jmatt J Matt Peterson [X] (Inactive) made changes -
            Reviewers Tim Jenness [ tjenness ]
            Status In Progress [ 3 ] In Review [ 10004 ]
            tjenness Tim Jenness made changes -
            Status In Review [ 10004 ] Reviewed [ 10101 ]
            tjenness Tim Jenness made changes -
            Link This issue relates to DM-5753 [ DM-5753 ]
            jmatt J Matt Peterson [X] (Inactive) made changes -
            Link This issue relates to DM-8135 [ DM-8135 ]
            jmatt J Matt Peterson [X] (Inactive) made changes -
            Resolution Done [ 10000 ]
            Status Reviewed [ 10101 ] Done [ 10002 ]

              People

              • Assignee:
                jmatt J Matt Peterson [X] (Inactive)
                Reporter:
                jmatt J Matt Peterson [X] (Inactive)
                Reviewers:
                Tim Jenness
                Watchers:
                J Matt Peterson [X] (Inactive), Pim Schellart [X] (Inactive), Robert Lupton, Tim Jenness
              • Votes:
                0 Vote for this issue
                Watchers:
                4 Start watching this issue

                Dates

                • Created:
                  Updated:
                  Resolved:

                  Summary Panel