Uploaded image for project: 'Data Management'
  1. Data Management
  2. DM-7701

conda-lsst ndarray test failure

    Details

    • Type: Story
    • Status: Done
    • Resolution: Done
    • Fix Version/s: None
    • Component/s: ndarray
    • Labels:
      None

      Description

      The conda-lsst build log for the test failure can be found here:

      https://gist.github.com/jmatt/dcb6ce8312aac1ff81cbb923703d8430

      Running tests...
      Test project /Users/square/dev/conda-lsst/miniconda/conda-bld/work/build
          Start 1: test_ndarray
      1/5 Test #1: test_ndarray .....................   Passed    0.01 sec
          Start 2: test_views
      2/5 Test #2: test_views .......................   Passed    0.01 sec
          Start 3: test_ndarray-fft
      3/5 Test #3: test_ndarray-fft .................***Exception: Other  0.00 sec
          Start 4: test_ndarray_eigen
      4/5 Test #4: test_ndarray_eigen ...............   Passed    0.01 sec
          Start 5: swig_test
      5/5 Test #5: swig_test ........................   Passed    0.11 sec
       
      80% tests passed, 1 tests failed out of 5
       
      Total Test time (real) =   0.14 sec
       
      The following tests FAILED:
      	  3 - test_ndarray-fft (OTHER_FAULT)
      Errors while running CTest
      make: *** [test] Error 8
      

        Attachments

          Issue Links

            Activity

              People

              • Assignee:
                jmatt J Matt Peterson [X] (Inactive)
                Reporter:
                jmatt J Matt Peterson [X] (Inactive)
                Reviewers:
                Tim Jenness
                Watchers:
                J Matt Peterson [X] (Inactive), Pim Schellart [X] (Inactive), Robert Lupton, Tim Jenness
              • Votes:
                0 Vote for this issue
                Watchers:
                4 Start watching this issue

                Dates

                • Created:
                  Updated:
                  Resolved:

                  Summary Panel